[lammps-users] Problem with May 12 Patch

When I tried applying the May 12 patch, it is causing the following message

Hunk #1 FAILED at 42.
Hunk #2 FAILED at 58.
Hunk #3 FAILED at 96.
Hunk #4 FAILED at 111.
Hunk #5 FAILED at 121.
Hunk #6 FAILED at 131.
6 out of 6 hunks FAILED -- saving rejects to file src/Makefile.rej

I have attached the Makefile.rej.

Could anyone please tell me what is going wrong?

Makefile.rej (3.2 KB)

Don't know what the patch problem is. I would just
download the new upgrade tar file from the download site.