Python.h error during Buliding lammps by MPI

Hi,

I get the following error when I Build lammps by MPI

Gathering installed package information (may take a little while)
make[1]: Entering directory ‘/home/awaneesh/lammps-23Jun2022/src’
Gathering git version information
make[1]: Leaving directory ‘/home/awaneesh/lammps-23Jun2022/src’
Compiling LAMMPS for machine mpi
make[1]: Entering directory ‘/home/awaneesh/lammps-23Jun2022/src/Obj_mpi’
make[1]: Leaving directory ‘/home/awaneesh/lammps-23Jun2022/src/Obj_mpi’
make[1]: Entering directory ‘/home/awaneesh/lammps-23Jun2022/src/Obj_mpi’
mpicxx -g -O3 -std=c++11 -DLAMMPS_GZIP -DLAMMPS_MEMALIGN=64 -DLMP_PYTHON -DMPICH_SKIP_MPICXX -DOMPI_SKIP_MPICXX=1 -c …/fix_python_invoke.cpp
In file included from …/fix_python_invoke.cpp:23:
…/python_compat.h:17:10: fatal error: Python.h: No such file or directory
17 | #include <Python.h>
| ^~~~~~~~~~
compilation terminated.
make[1]: *** [Makefile:114: fix_python_invoke.o] Error 1
make[1]: Leaving directory ‘/home/awaneesh/lammps-23Jun2022/src/Obj_mpi’
make: *** [Makefile:393: mpi] Error 2

You either must install the development headers of your python version where LAMMPS can find them, or you must not include the PYTHON package.

If you have difficulties with how to properly configure LAMMPS using the traditional build system, please consider using the CMake method. It can better verify whether required prerequisites are available.

Thanks for your reply.
As you suggest I did not include PYTHON package during build lammps, Now it perfectly install.
I will also try to configure LAMMPS using CMake method.